{"text_format":"2","workbook":"xlsx","n_sheets":15,"sheets":["Übersicht und Anleitung","Verpflegungsplan KVK","Woche 1","Woche 2","Woche 3","Plan subs CC","Semaine 1","Semaine 2","Semaine 3","Piano suss CQ","Settimana 1","Settimana 2","Settimana 3","Preise Prix Prezzi","Vpf Art Genre Subs Tipi di suss"],"not_rendered":{"charts":0,"images":2,"macros":0,"external_links":0,"defined_names":6,"comments":0,"pivot_tables":0},"unopened":[],"bounds":{"document_bytes":16777216,"sheet_cells":100000,"run_cost":"one","rows_first":2000,"rows_last":500,"rows_between":2000,"halvings":0,"cell_chars":16384,"cell_head_chars":4096},"cells_cut":0,"cells_raw":0,"read":"whole","date_system":"1900"}

{"sheet":"Übersicht und Anleitung","index":0,"n_rows":27,"n_cols":19,"rows_kept":27,"cut":false,"hidden":false,"merged":[]}
["Verpflegungsplan Frühling / Plan de la subsistance printemps / Piano di sussistenza primavera",{"$nulls":17},"3003 Bern, 24.01.2023 / SCHOL"]
[]
["Übersicht Verpflegungsabrechnung / Vue ensemble décompte de la subsistance / Visione d'assieme conteggio della sussistenza"]
[]
["Woche\nSemaine\nSettimana","Kredit\nCrédit\nCredito\n","Verbrauch\nUtilisation\nUtilizzo\n","Saldo\nSolde\nSaldo"]
["KVK, CCV, CQ",{"$f":"'Verpflegungsplan KVK'!E85","v":6300},{"$f":"'Verpflegungsplan KVK'!E84","v":5557.9000000000005},{"$f":"B6-C6","v":742.09999999999945}]
[]
[1,{"$f":"'Woche 1'!E85","v":6300},{"$f":"'Woche 1'!E84","v":6166.6},{"$f":"B8-C8","v":133.39999999999964}]
[2,{"$f":"'Woche 2'!E85","v":6300},{"$f":"'Woche 2'!E84","v":6268.6},{"$f":"B9-C9","v":31.399999999999636}]
[3,{"$f":"'Woche 3'!E85","v":4500},{"$f":"'Woche 3'!E84","v":5378.2999999999993},-878.29999999999927]
{"$rows_left_out":18}
{"sheet":"Verpflegungsplan KVK","index":1,"n_rows":91,"n_cols":20,"rows_kept":91,"cut":false,"hidden":false,"merged":[[83,4,83,6],[84,4,84,6],[85,4,85,6],[0,18,0,19],[85,8,85,10],[85,13,85,15],[85,18,85,19],[2,1,2,5],[2,6,2,10],[2,11,2,15],[2,16,2,19],[82,4,82,6]]}
["Verpflegungsplan ",{"$nulls":5},"von:",null,"2018-04-30",null,null,"bis:",null,{"$f":"A73","v":"2018-05-06"},null,"Einheit"]
[]
[null,"Frühstück",{"$nulls":4},"Mittagessen",{"$nulls":4},"Nachtessen",{"$nulls":4},"Fleischlos"]
[null,"CCP","Visum",null,"Preis","Rezept","CCP","Visum",null,"Preis","Rezept","CCP","Visum",null,"Preis","Rezept","CCP","Visum",null,"Rezept"]
[null,null,null,"Normalbestand",{"$f":"VLOOKUP(D5,'Vpf Art Genre Subs Tipi di suss'!$A:$B,2,FALSE)","v":1},null,null,null,"Normalbestand",{"$f":"VLOOKUP(I5,'Vpf Art Genre Subs Tipi di suss'!$A:$B,2,FALSE)","v":1},null,null,null,"Normalbestand",{"$f":"VLOOKUP(N5,'Vpf Art Genre Subs Tipi di suss'!$A:$B,2,FALSE)","v":1},null,null,null,"Mittag"]
["Montag",{"$nulls":7},"Pastetli mit Fleischfüllung und Pilzen",2.33,923,null,null,"Bouillon mit Flädli 50 %",0.05,205,null,null,"Pastetli mit Pilzfüllung",923]
[{"$f":"I1","v":"2018-04-30"},{"$nulls":12},"Maccaroni mit Butter",0.27,617]
[{"$nulls":8},"Brot 100 g ",0.39,null,null,null,"Sauce Waluca",0.68,311]
[{"$nulls":13},"Rüeblisalat",0.61,812]
[{"$f":"SUM(O6:O15)*O5+SUM(J6:J15)*J5+SUM(E6:E15)*E5","v":7.08},{"$nulls":17},"Abend"]
{"$rows_left_out":82}
{"sheet":"Woche 1","index":2,"n_rows":91,"n_cols":20,"rows_kept":91,"cut":false,"hidden":false,"merged":[[83,4,83,6],[84,4,84,6],[85,4,85,6],[0,18,0,19],[2,1,2,5],[2,6,2,10],[2,11,2,15],[2,16,2,19],[82,4,82,6]]}
["Verpflegungsplan ",{"$nulls":5},"von:",null,"2018-05-07",null,null,"bis:",null,{"$f":"A73","v":"2018-05-13"},null,"Einheit"]
[]
[null,"Frühstück",{"$nulls":4},"Mittagessen",{"$nulls":4},"Nachtessen",{"$nulls":4},"Fleischlos"]
[null,"CCP","Visum",null,"Preis","Rezept","CCP","Visum",null,"Preis","Rezept","CCP","Visum",null,"Preis","Rezept","CCP","Visum",null,"Rezept"]
[null,null,null,"Sonntagswache",{"$f":"VLOOKUP(D5,'Vpf Art Genre Subs Tipi di suss'!$A:$B,2,FALSE)","v":0.1},null,null,null,"Normalbestand",{"$f":"VLOOKUP(I5,'Vpf Art Genre Subs Tipi di suss'!$A:$B,2,FALSE)","v":1},null,null,null,"Normalbestand",{"$f":"VLOOKUP(N5,'Vpf Art Genre Subs Tipi di suss'!$A:$B,2,FALSE)","v":1},null,null,null,"Mittag"]
["Montag",null,null,"Kaffee in Portionen 50 %",0.2,null,null,null,"Bouillon mit Backerbsen 50 %",0.05,205,null,null,"Curryrahmsuppe 50 %",0.1,212,null,null,"Spinatravioli mit Käse",824]
[{"$f":"I1","v":"2018-05-07"},null,null,"Kakao/Malzgetränk in Port 50 %",0.2,null,null,null,"Ravioli",1,926,"*",null,"Pouletschenkel geschmort",2.37]
[null,null,null,"Brotsorten 100 g",0.39,null,null,null,"Reibkäse 20 g",0.25,null,null,null,"an Rotweinsauce"]
[null,null,null,"Butter Port 20 g",0.44,null,null,null,"Mischsalat Frühling",0.46,null,null,null,"Lyoner Kartoffeln",1,600]
[{"$f":"SUM(O6:O15)*O5+SUM(J6:J15)*J5+SUM(E6:E15)*E5","v":8.5530000000000008},null,null,"Konfitüre/Nussaufstrich 1",0.17,null,null,null,"Franz Salatsauce 30 g",0.05,null,null,null,"Blattspinat gedünstet",0.73,704,null,null,"Abend"]
{"$rows_left_out":82}
{"sheet":"Woche 2","index":3,"n_rows":91,"n_cols":20,"rows_kept":91,"cut":false,"hidden":false,"merged":[[83,4,83,6],[84,4,84,6],[85,4,85,6],[0,18,0,19],[2,1,2,5],[2,6,2,10],[2,11,2,15],[2,16,2,19],[82,4,82,6]]}
["Verpflegungsplan ",{"$nulls":5},"von:",null,"2018-05-14",null,null,"bis:",null,{"$f":"A73","v":"2018-05-20"},null,"Einheit"]
[]
[null,"Frühstück",{"$nulls":4},"Mittagessen",{"$nulls":4},"Nachtessen",{"$nulls":4},"Fleischlos"]
[null,"CCP","Visum",null,"Preis","Rezept","CCP","Visum",null,"Preis","Rezept","CCP","Visum",null,"Preis","Rezept","CCP","Visum",null,"Rezept"]
[null,null,null,"Normalbestand",{"$f":"VLOOKUP(D5,'Vpf Art Genre Subs Tipi di suss'!$A:$B,2,FALSE)","v":1},null,null,null,"Normalbestand",{"$f":"VLOOKUP(I5,'Vpf Art Genre Subs Tipi di suss'!$A:$B,2,FALSE)","v":1},null,null,null,"Normalbestand",{"$f":"VLOOKUP(N5,'Vpf Art Genre Subs Tipi di suss'!$A:$B,2,FALSE)","v":1},null,null,null,"Mittag"]
["Montag",null,null,"Kaffee in Portionen 50 %",0.2,null,null,null,"Bouillon mit Fideli 50%",0.05,205,null,null,"Gemüsesuppe Bauernart 50 %",0.25,204,null,null,"Älplermakkaronen",900]
[{"$f":"I1","v":"2018-05-14"},null,null,"Kakao/Malzgetränk in Port 50 %",0.2,null,null,null,"Älplermakkaraonen",1.94,900,"*",null,"Schweinsbratwurst mit",2.52]
[null,null,null,"Brotsorten 100 g",0.39,null,null,null,"Apfelkompott",0.57999999999999996,1109,null,null,"Zwiebelsauce 50 %",0.2,301]
[null,null,null,"Butter Port 20 g",0.44,null,null,null,"Mischsalat Frühling",0.46,null,null,null,"Rösti",0.49,612]
[{"$f":"SUM(O6:O15)*O5+SUM(J6:J15)*J5+SUM(E6:E15)*E5","v":11.99},null,null,"Konfitüre/Nussaufstrich 1",0.17,null,null,null,"Balsamico Salatsauce 30 g",0.05,null,null,null,"Kräutertomate",0.5,707,null,null,"Abend"]
{"$rows_left_out":82}
{"sheet":"Woche 3","index":4,"n_rows":91,"n_cols":22,"rows_kept":91,"cut":false,"hidden":false,"merged":[[83,4,83,6],[84,4,84,6],[85,4,85,6],[0,18,0,19],[2,1,2,5],[2,6,2,10],[2,11,2,15],[2,16,2,19],[82,4,82,6]]}
["Verpflegungsplan ",{"$nulls":5},"von:",null,"2018-05-21",null,null,"bis:",null,{"$f":"A73","v":"2018-05-27"},null,"Einheit"]
[]
[null,"Frühstück",{"$nulls":4},"Mittagessen",{"$nulls":4},"Nachtessen",{"$nulls":4},"Fleischlos"]
[null,"CCP","Visum",null,"Preis","Rezept","CCP","Visum",null,"Preis","Rezept","CCP","Visum",null,"Preis","Rezept","CCP","Visum",null,"Rezept"]
[null,null,null,"Normalbestand",{"$f":"VLOOKUP(D5,'Vpf Art Genre Subs Tipi di suss'!$A:$B,2,FALSE)","v":1},null,null,null,"Normalbestand",{"$f":"VLOOKUP(I5,'Vpf Art Genre Subs Tipi di suss'!$A:$B,2,FALSE)","v":1},null,null,null,"Normalbestand",{"$f":"VLOOKUP(N5,'Vpf Art Genre Subs Tipi di suss'!$A:$B,2,FALSE)","v":1},null,null,null,"Mittag"]
["Montag",null,null,"Kaffee in Portionen 50 %",0.2,null,null,null,"Bouillon mit Flädli 50 %",0.05,205,null,null,"Kressecremesuppe 50 %",0.14000000000000001,208,null,null,"Spaghetti mit Butter",617]
[{"$f":"I1","v":"2018-05-21"},null,null,"Kakao/Malzgetränk in Port 50 %",0.2,null,null,null,"Spaghetti ",0.25,617,"*",null,"Hausgemachter Hackbraten ",1.92,null,null,null,"Tomatensauce",311]
[null,null,null,"Brotsorten 100 g",0.39,null,null,null,"Tomatensauce",0.16,311,null,null,"Senfsauce",7.0000000000000007E-2,301,null,null,"Pesto CF4 20 g"]
[null,null,null,"Butter Port 20 g",0.44,null,null,null,"Pesto CF4 20 g",7.0000000000000007E-2,null,null,null,"Neue Bratkartoffeln",0.96,600]
[{"$f":"SUM(O6:O15)*O5+SUM(J6:J15)*J5+SUM(E6:E15)*E5","v":9.15},null,null,"Konfitüre/Nussaufstrich 1",0.17,null,null,null,"Mischsalat Frühling",0.46,null,null,null,"Rüebli gedünstet",0.49,704,null,null,"Abend"]
{"$rows_left_out":82}
{"sheet":"Plan subs CC","index":5,"n_rows":91,"n_cols":22,"rows_kept":91,"cut":false,"hidden":false,"merged":[[82,4,82,6],[82,13,82,15],[85,18,85,19],[83,4,83,6],[83,8,83,11],[84,4,84,6],[85,4,85,6],[85,8,85,10],[85,13,85,15],[0,18,0,19],[2,1,2,5],[2,6,2,10],[2,11,2,15],[2,16,2,19]]}
["Plan de la subsistance",{"$nulls":5},"du:",null,"2018-04-30",null,null,"à:",null,{"$f":"A73","v":"2018-05-06"},null,"Unité:"]
[]
[null,"Petit déjeuner",{"$nulls":4},"Dîner",{"$nulls":4},"Souper",{"$nulls":4},"Sans viande"]
[null,"PCC","Visa",null,"Prix","Recette","PCC","Visa",null,"Prix","Recette","PCC","Visa",null,"Prix","Recette","PCC","Visa",null,"Recette"]
[null,null,null,"Effectif normal",1,null,null,null,"Effectif normal",1,null,null,null,"Effectif normal",1,null,null,null,"Dîner"]
["Lundi",{"$nulls":7},"Vol-au-vent avec sauce viande et champignons",2.33,923,null,null,"Bouillon aux célestines 50 %",0.05,205,null,null,"Vol-au-vent aux champignons",821]
[{"$f":"I1","v":"2018-04-30"},{"$nulls":12},"Maccaroni au beurre",0.27,617]
[{"$nulls":8},"Pain 100 g ",0.39,null,null,null,"Sauce Waluca",0.68,311]
[{"$nulls":13},"Salade de carottes",0.61,812]
[{"$f":"SUM(O6:O15)*O5+SUM(J6:J15)*J5+SUM(E6:E15)*E5","v":7.08},{"$nulls":17},"Souper"]
{"$rows_left_out":82}
{"sheet":"Semaine 1","index":6,"n_rows":91,"n_cols":22,"rows_kept":91,"cut":false,"hidden":false,"merged":[[82,4,82,6],[82,13,82,15],[85,18,85,19],[83,4,83,6],[83,8,83,11],[84,4,84,6],[85,4,85,6],[85,8,85,10],[85,13,85,15],[0,18,0,19],[2,1,2,5],[2,6,2,10],[2,11,2,15],[2,16,2,19]]}
["Plan de la subsistance",{"$nulls":5},"du:",null,"2018-05-07",null,null,"à:",null,{"$f":"A73","v":"2018-05-13"},null,"Unité:"]
[]
[null,"Petit déjeuner",{"$nulls":4},"Dîner",{"$nulls":4},"Souper",{"$nulls":4},"Sans viande"]
[null,"PCC","Visa",null,"Prix","Recette","PCC","Visa",null,"Prix","Recette","PCC","Visa",null,"Prix","Recette","PCC","Visa",null,"Recette"]
[null,null,null,"Garde weekend",0.1,null,null,null,"Effectif normal",1,null,null,null,"Effectif normal",1,null,null,null,"Dîner"]
["Lundi",null,null,"Café en portion 50 %",0.2,null,null,null,"Bouillon aux pois frits",0.05,205,null,null,"Velouté épicé",0.1,212,null,null,"Ravioli aux épinards",824]
[{"$f":"I1","v":"2018-05-07"},null,null,"Boisson cacao/malt en port 50 %",0.2,null,null,null,"Ravioli",1,926,"*",null,"Cuisse de poulet étuvées",2.37]
[null,null,null,"Assortiment pains 100 g",0.39,null,null,null,"Fromage râpé 20 g",0.25,null,null,null,"à la sauce au vin rouge"]
[null,null,null,"Beurre portion 20 g",0.44,null,null,null,"Salade Mêlée de printemps",0.46,null,null,null,"Pommes aux oignons",1,600]
[{"$f":"SUM(O6:O15)*O5+SUM(J6:J15)*J5+SUM(E6:E15)*E5","v":8.5530000000000008},null,null,"Confiture/Crème noisettes 1",0.17,null,null,null,"Sauce salade française  30 g",0.05,null,null,null,"Épinards à l'étouffée",0.73,704,null,null,"Souper"]
{"$rows_left_out":82}
{"sheet":"Semaine 2","index":7,"n_rows":91,"n_cols":22,"rows_kept":91,"cut":false,"hidden":false,"merged":[[82,4,82,6],[82,13,82,15],[85,18,85,19],[83,4,83,6],[83,8,83,11],[84,4,84,6],[85,4,85,6],[85,8,85,10],[85,13,85,15],[0,18,0,19],[2,1,2,5],[2,6,2,10],[2,11,2,15],[2,16,2,19]]}
["Plan de la subsistance",{"$nulls":5},"du:",null,"2018-05-14",null,null,"à:",null,{"$f":"A73","v":"2018-05-20"},null,"Unité:"]
[]
[null,"Petit déjeuner",{"$nulls":4},"Dîner",{"$nulls":4},"Souper",{"$nulls":4},"Sans viande"]
[null,"PCC","Visa",null,"Prix","Recette","PCC","Visa",null,"Prix","Recette","PCC","Visa",null,"Prix","Recette","PCC","Visa",null,"Recette"]
[null,null,null,"Effectif normal",1,null,null,null,"Effectif normal",1,null,null,null,"Effectif normal",1,null,null,null,"Dîner"]
["Lundi",null,null,"Café en portion 50 %",0.2,null,null,null,"Bouillon aux célestines 50 %",0.05,205,null,null,"Potage paysanne 50 %",0.25,204,null,null,"Macaroni des alpages",900]
[{"$f":"I1","v":"2018-05-14"},null,null,"Boisson cacao/malt en port 50 %",0.2,null,null,null,"Macaroni des alpages",1.94,900,"*",null,"Saucisse de porc avec",2.52]
[null,null,null,"Assortiment pains 100 g",0.39,null,null,null,"Compote aux pommes",0.57999999999999996,1109,null,null,"Sauce oignons 50 %",0.2,301]
[null,null,null,"Beurre portion 20 g",0.44,null,null,null,"Salade mêlée de printemps 30 %",0.46,null,null,null,"Rösti",0.49,612]
[{"$f":"SUM(O6:O15)*O5+SUM(J6:J15)*J5+SUM(E6:E15)*E5","v":11.99},null,null,"Confiture/Crème noisettes 1",0.17,null,null,null,"Salade sauce balsamico 30 g",0.05,null,null,null,"Tomates provençales",0.5,707,null,null,"Souper"]
{"$rows_left_out":82}
{"sheet":"Semaine 3","index":8,"n_rows":91,"n_cols":22,"rows_kept":91,"cut":false,"hidden":false,"merged":[[82,4,82,6],[82,13,82,15],[85,18,85,19],[83,4,83,6],[83,8,83,11],[84,4,84,6],[85,4,85,6],[85,8,85,10],[85,13,85,15],[0,18,0,19],[2,1,2,5],[2,6,2,10],[2,11,2,15],[2,16,2,19]]}
["Plan de la subsistance",{"$nulls":5},"du:",null,"2018-05-21",null,null,"à:",null,{"$f":"A73","v":"2018-05-27"},null,"Unité:"]
[]
[null,"Petit déjeuner",{"$nulls":4},"Dîner",{"$nulls":4},"Souper",{"$nulls":4},"Sans viande"]
[null,"PCC","Visa",null,"Prix","Recette","PCC","Visa",null,"Prix","Recette","PCC","Visa",null,"Prix","Recette","PCC","Visa",null,"Recette"]
[null,null,null,"Effectif normal",1,null,null,null,"Effectif normal",1,null,null,null,"Effectif normal",1,null,null,null,"Dîner"]
["Lundi",null,null,"Café en portion 50 %",0.2,null,null,null,"Bouillon aux célestines 50 %",0.05,205,null,null,"Crème au cresson 50 %",0.14000000000000001,208,null,null,"Spaghettis",617]
[{"$f":"I1","v":"2018-05-21"},null,null,"Boisson cacao/malt en port 50 %",0.2,null,null,null,"Spaghettis",0.25,617,"*",null,"Rôti haché de porc maison",1.92,null,null,null,"Sauce  tomates",311]
[null,null,null,"Assortiment pains 100 g",0.39,null,null,null,"Sauce  tomates",0.16,311,null,null,"Sauce moutarde (brune)",7.0000000000000007E-2,301,null,null,"Pesto CF 4 20 g"]
[null,null,null,"Beurre portion 20 g",0.44,null,null,null,"Pesto CF 4 20 g",7.0000000000000007E-2,null,null,null,"Pommes nouvelles sautées",0.96,600]
[{"$f":"SUM(O6:O15)*O5+SUM(J6:J15)*J5+SUM(E6:E15)*E5","v":9.15},null,null,"Confiture/Crème noisettes 1",0.17,null,null,null,"Salade Mêlée de printemps",0.46,null,null,null,"Carottes étuvées",0.49,704,null,null,"Souper"]
{"$rows_left_out":82}
{"sheet":"Piano suss CQ","index":9,"n_rows":91,"n_cols":20,"rows_kept":91,"cut":false,"hidden":false,"merged":[[85,18,85,19],[0,18,0,19],[2,1,2,5],[2,6,2,10],[2,11,2,15],[2,16,2,19],[82,4,82,6],[83,4,83,6],[84,4,84,6],[85,4,85,6],[85,8,85,10],[85,13,85,15]]}
["Piano di sussistenza",{"$nulls":5},"da:",null,"2018-04-30",null,null,"a:",null,{"$f":"A73","v":"2018-05-06"},null,"Unità:"]
[]
[null,"Colazione",{"$nulls":4},"Pranzo",{"$nulls":4},"Cena",{"$nulls":4},"senza carne"]
[null,"PCC","Visto",null,"Prezzo","Ricetta","PCC","Visto",null,"Prezzo","Ricetta","PCC","Visto",null,"Prezzo","Ricetta","PCC","Visto",null,"Ricetta"]
[null,null,null,"Effetivo normale",1,null,null,null,"Effetivo normale",1,null,null,null,"Effetivo normale",1,null,null,null,"Pranzo"]
["Lunedì",{"$nulls":7},"Vol-au-vent con salsa di carne e funghi",2.33,923,null,null,"Brodo celestino 50%",0.05,205,null,null,"Vol au vent con funghi",923]
[{"$f":"I1","v":"2018-04-30"},{"$nulls":12},"Maccheroni con burro",0.27,617]
[{"$nulls":8},"Pane 100 g ",0.39,null,null,null,"Salsa Waluca",0.68,311]
[{"$nulls":13},"Insalata di carote ",0.61,812]
[{"$f":"SUM(O6:O15)*O5+SUM(J6:J15)*J5+SUM(E6:E15)*E5","v":7.08},{"$nulls":17},"Cena"]
{"$rows_left_out":82}
{"sheet":"Settimana 1","index":10,"n_rows":91,"n_cols":20,"rows_kept":91,"cut":false,"hidden":false,"merged":[[85,18,85,19],[0,18,0,19],[2,1,2,5],[2,6,2,10],[2,11,2,15],[2,16,2,19],[82,4,82,6],[83,4,83,6],[84,4,84,6],[85,4,85,6],[85,8,85,10],[85,13,85,15]]}
["Piano di sussistenza",{"$nulls":5},"da:",null,"2018-05-07",null,null,"a:",null,{"$f":"A73","v":"2018-05-13"},null,"Unità:"]
[]
[null,"Colazione",{"$nulls":4},"Pranzo",{"$nulls":4},"Cena",{"$nulls":4},"senza carne"]
[null,"PCC","Visto",null,"Prezzo","Ricetta","PCC","Visto",null,"Prezzo","Ricetta","PCC","Visto",null,"Prezzo","Ricetta","PCC","Visto",null,"Ricetta"]
[null,null,null,"Guardia",0.1,null,null,null,"Effetivo normale",1,null,null,null,"Effetivo normale",1,null,null,null,"Pranzo"]
["Lunedì",null,null,"Caffè 50%",0.2,null,null,null,"Brodo palline fritte",0.05,205,null,null,"Crema di curry 50 %",0.1,212,null,null,"Ravioli di spinaci",824]
[{"$f":"I1","v":"2018-05-07"},null,null,"Cacao/bevanda al malto in porzioni 50%",0.2,null,null,null,"Ravioli",1,926,"*",null,"Asta di pollo",2.37]
[null,null,null,"Sorta di pane 100g",0.39,null,null,null,"Ricotta 20 g",0.25,null,null,null,"Salsa al vino rosso"]
[null,null,null,"Burro porzione 20g",0.44,null,null,null,"Insalata mista primavera 30%",0.46,null,null,null,"Patate di lyoner",1,600]
[{"$f":"SUM(O6:O15)*O5+SUM(J6:J15)*J5+SUM(E6:E15)*E5","v":8.5530000000000008},null,null,"Marmellata/Spalmatura di noci 1",0.17,null,null,null,"Salsa per insalata francese  ",0.05,null,null,null,"Spinaci",0.73,704,null,null,"Cena"]
{"$rows_left_out":82}
{"sheet":"Settimana 2","index":11,"n_rows":91,"n_cols":20,"rows_kept":91,"cut":false,"hidden":false,"merged":[[85,18,85,19],[0,18,0,19],[2,1,2,5],[2,6,2,10],[2,11,2,15],[2,16,2,19],[82,4,82,6],[83,4,83,6],[84,4,84,6],[85,4,85,6],[85,8,85,10],[85,13,85,15]]}
["Piano di sussistenza",{"$nulls":5},"da:",null,"2018-05-14",null,null,"a:",null,{"$f":"A73","v":"2018-05-20"},null,"Unità:"]
[]
[null,"Colazione",{"$nulls":4},"Pranzo",{"$nulls":4},"Cena",{"$nulls":4},"senza carne"]
[null,"PCC","Visto",null,"Prezzo","Ricetta","PCC","Visto",null,"Prezzo","Ricetta","PCC","Visto",null,"Prezzo","Ricetta","PCC","Visto",null,"Ricetta"]
[null,null,null,"Effetivo normale",1,null,null,null,"Effetivo normale",1,null,null,null,"Effetivo normale",1,null,null,null,"Pranzo"]
["Lunedì",null,null,"Caffè 50%",0.2,null,null,null,"Brodo con Fideli 50%",0.05,205,null,null,"Zuppa di verdure paesana 50 %",0.25,204,null,null,"Maccheroni delle alpi",900]
[{"$f":"I1","v":"2018-05-14"},null,null,"Cacao/bevanda al malto in porzioni 50%",0.2,null,null,null,"Maccheroni delle alpi",1.94,900,"*",null,"Salsicce di maiale con",2.52]
[null,null,null,"Sorta di pane 100g",0.39,null,null,null,"Composta di mele",0.57999999999999996,1109,null,null,"Salsa alle cipolle",0.2,301]
[null,null,null,"Burro porzione 20g",0.44,null,null,null,"Insalata mista primavera 30%",0.46,null,null,null,"Rösti",0.49,612]
[{"$f":"SUM(O6:O15)*O5+SUM(J6:J15)*J5+SUM(E6:E15)*E5","v":11.99},null,null,"Marmellata/Spalmatura di noci 1",0.17,null,null,null,"Salsa per insalata balsamico 30g",0.05,null,null,null,"Pomodori alla provinciale",0.5,707,null,null,"Cena"]
{"$rows_left_out":82}
{"sheet":"Settimana 3","index":12,"n_rows":91,"n_cols":22,"rows_kept":91,"cut":false,"hidden":false,"merged":[[85,18,85,19],[0,18,0,19],[2,1,2,5],[2,6,2,10],[2,11,2,15],[2,16,2,19],[82,4,82,6],[83,4,83,6],[84,4,84,6],[85,4,85,6],[85,8,85,10],[85,13,85,15]]}
["Piano di sussistenza",{"$nulls":5},"da:",null,"2018-05-21",null,null,"a:",null,{"$f":"A73","v":"2018-05-27"},null,"Unità:"]
[]
[null,"Colazione",{"$nulls":4},"Pranzo",{"$nulls":4},"Cena",{"$nulls":4},"senza carne"]
[null,"PCC","Visto",null,"Prezzo","Ricetta","PCC","Visto",null,"Prezzo","Ricetta","PCC","Visto",null,"Prezzo","Ricetta","PCC","Visto",null,"Ricetta"]
[null,null,null,"Effetivo normale",1,null,null,null,"Effetivo normale",1,null,null,null,"Effetivo normale",1,null,null,null,"Pranzo"]
["Lunedì",null,null,"Caffè 50%",0.2,null,null,null,"Brodo celestino 50%",0.05,205,null,null,"Crema al crescione 50%",0.14000000000000001,208,null,null,"Spaghetti con burro",617]
[{"$f":"I1","v":"2018-05-21"},null,null,"Cacao/bevanda al malto in porzioni 50%",0.2,null,null,null,"Spaghetti ",0.25,617,"*",null,"Polpettone casareccio",1.92,null,null,null,"Salsa al pomodoro",311]
[null,null,null,"Sorta di pane 100g",0.39,null,null,null,"Salsa al pomodoro",0.16,311,null,null,"Salsa senape",7.0000000000000007E-2,301,null,null,"Pesto CF4 20 g"]
[null,null,null,"Burro porzione 20g",0.44,null,null,null,"Pesto CF4 20 g",7.0000000000000007E-2,null,null,null,"Patate arrostite",0.96,600]
[{"$f":"SUM(O6:O15)*O5+SUM(J6:J15)*J5+SUM(E6:E15)*E5","v":9.15},null,null,"Marmellata/Spalmatura di noci 1",0.17,null,null,null,"Insalata mista primavera 30%",0.46,null,null,null,"Carote stufate",0.49,704,null,null,"Cena"]
{"$rows_left_out":82}
{"sheet":"Preise Prix Prezzi","index":13,"n_rows":411,"n_cols":15,"rows_kept":411,"cut":false,"hidden":false,"merged":[]}
["Preise für Militärspeisen"]
[]
["Gerichte Liste","Preis",null,"Liste des mets","Preis",null,"Lista ricetta","Preis",null,"Gewicht in g","Prozent"]
[null,"pro Person",null,null,"pro Person",null,null,"pro Person",null,"pro Person","Anteil gem KR"]
["1 Getränke / Frühstück",null,"Rezept #","1 Boisson / petit déjeuner",null,"Recette #","1 Bevanda / prima colazione",null,"Ricetta #"]
["Apfel-Pfirsichtee",0.04,null,"Thé froid",0.04,null,"Tè freddo",0.04,null,248,1]
["Kaffee",0.22,null,"Café ",0.22,null,"Caffè ",0.22,null,221,1]
["Kräuter / Früchtetee",0.05,100,"Thé aux herbes / aux fruits",0.05,100,"Tè alle erbe / Tè di frutta",0.05,100,474,1]
["Kaffee in Portionen",0.22,null,"Café en portion",0.22,null,"Caffè latte",0.22,null,304,1]
["Schokoladenmilch",0.13,null,"Chocolat au lait",0.13,null,"Cioccolata al latte",0.13,null,270,1,null," "]
{"$rows_left_out":402}
{"sheet":"Vpf Art Genre Subs Tipi di suss","index":14,"n_rows":12,"n_cols":2,"rows_kept":12,"cut":false,"hidden":false,"merged":[]}
["Normalbestand",1]
["Leistungsabtreten",0.75]
["Fakultatives Nachtessen",0.3]
["Sonntagswache",0.1]
["Effectif normal",1]
["Licenciement selon performance",0.75]
["Souper facultatif",0.3]
["Garde weekend",0.1]
["Effetivo normale",1]
["Congedo di prestazione",0.75]
{"$rows_left_out":2}